VendorID,Firstname,Middle,Lastname,Address2,Address1,City,State,Zip,ZIP4,Employer,Occupation,HomePhone,Email,contrib_Amount,contrib_Date,contrib_Account
2162006,Geraldine,,Gillio,,15 Kuhn St.,Somerset,NJ,08873,3324,Jersey City Bd of Ed,Teacherr, 201 434 3888,,25.00,2/20/2007,800
3854015,Lawrence,,Grunberger,,1 Byrds Hill Rd.,Pawling,NY,12564,1630,,, 914 739 7443,,25.00,2/20/2007,800
5989611,Frank,G.,Verterano,,235 Beechwood Rd.,New Wilmngtn,PA,16142,1416,Self-Employed,Attorney, 724 946 3024,,25.00,2/20/2007,800
6109235,John,,Kupchinsky,,580 Harvest Dr.,Harrisburg,PA,17111,5659,"Willis,Williams & Davidson",Attorney, 717 564 8138,,25.00,2/26/2007,800
26862854,Kermit,,Owens,,P.O. Box 609,Vansant,VA,24656,0609,Buchanan Co. Sheriff Office,Deputy Sheriff,,,20.00,2/27/2007,800
26877886,Loretta,,Sims,,10750 Lexington Dr.,Olive Branch,MS,38654,9328,N/A,Retired, 205 933 6668,,10.00,2/23/2007,800
14961403,Gerald,P.,Dinneen,Apt. C460,1010 Waltham St.,Lexington,MA,02421,8066,N/A,Retired, 781 863 1720,,50.00,2/21/2007,800
12480794,Rita,,Frankel,Apt. 407,25805 Fairmount Blvd.,Beachwood,OH,44122,2258,N/A,Retired, 216 292 7968,,10.00,2/21/2007,800
13343744,June,,Rusten,,1733 Dunmore Rd.,Ann Arbor,MI,48103,5929,Aaps,Retired Teacher, 734 996 2596,,30.00,2/21/2007,800
14314850,David,S.,Dahl,,2428 E Beverly Rd.,Shorewood,WI,53211,2426,Aurora Health Care,Physician,,,20.00,2/26/2007,800
14850853,Gerhard,H.,Weiss,,4101 Abbott Ave. S,Minneapolis,MN,55410,1004,N/A,Retired, 612 922 5352,,50.00,2/23/2007,800
14851760,Lawrence,,Batkiewicz,Apt. 125,5300 Oak Grove Pkwy N,Minneapolis,MN,55443,4059,N/A,Retired, 612 522 6960,,15.00,2/27/2007,800
15150899,Ruth,,Stowsand,,307 E 9th St. Apt. 1,Hartford,SD,57033,2269,N/A,Retired, 605 528 3469,,25.00,2/21/2007,800
15657612,Linda,,Cohen,,211 N Vine St.,Hinsdale,IL,60521,3318,Welsh & Katz,Attorney, 630 850 9470,,40.00,2/23/2007,800
28614907,Anne,,Chussil,Apt. 5B,893 Farmington Ave.,West Hartford,CT,06119,1455,Plainville Board of Education,Teacher, 860 233 6612,,2.00,2/27/2007,800
27895689,Philip,,Pfister,# 3E,1625 W Wilson Ave.,Chicago,IL,60640,5417,N/A,Retired, 773 334 2181,PHILPFISTER@AOL.COM,50.00,2/27/2007,800
16274540,Stanley,M.,Wald,,710 S Hanley Rd. Apt. 8C,Saint Louis,MO,63105,2656,,, 314 727 3377,,50.00,2/21/2007,800
16970519,Doris,B.,Miller,,P.O. Box 186,Stuart,NE,68780,0186,N/A,Retired, 402 924 3903,,25.00,2/27/2007,800
832597496,Marcus,S.,Mosbacker,,105 Terrace Dr. Apt. A,Brownsville,TX,78521,5633,Brownville I S D,Teacher, 956 574 9665,MMOSBACK50@YAHOO.COM,15.00,2/27/2007,800
18282848,T.,W.,Smith,,3301 Stevenson Ave.,Austin,TX,78703,2145,,, 512 477 7767,,25.00,2/14/2007,800
18407924,D.,O.,Pollard,,6514 4th St.,Lubbock,TX,79416,3728,,, 806 791 4823,,52.00,2/27/2007,800
18470864,Eleanor,,Carroll,,112 Tobar Way,El Paso,TX,79912,4514,N/A,Retired, 915 584 1734,,35.00,2/27/2007,800
18582163,Haruko,,Ishiyama,Apt. 302,800 Washington St.,Denver,CO,80203,3363,N/A,Retired, 303 832 3984,,35.00,2/23/2007,800
28362945,Joan,,Downing,,960 Wayne Ave.,Pocatello,ID,83201,3612,N/A,Retired, 208 233 0585,,15.00,2/22/2007,800
28204477,Ellis,,Holland,,3547 N Valorie Dr.,Prescott Valley,AZ,86314,8235,N/A,Retired, 928 772 9480,,25.00,2/23/2007,800
21339403,Julie,C.,Barton,,314 N Clybourn Avenue,Burbank,CA,91505,3701,N/A,Retired, 818 841 7785,,35.00,2/20/2007,800
22137269,Joanne,,Hinchliff,,P.O. Box 685,San Jacinto,CA,92581,0685,N/A,Retired,,,50.00,2/26/2007,800
22339717,Alice,,Swan,,5451 Calle Pico,Laguna Hills,CA,92637,2788,N/A,Retired, 949 581 7947,,25.00,2/23/2007,800
23447782,Anthony,E.,Ramirez,,5541 Diamond Heights Blvd.,San Francisco,CA,94131,2642,Retired School Administrator,Retired School Admin, 415 585 5714,,50.00,2/16/2007,800
28959930,Carol,,Chetkovich,,2023 Hoover Ave.,Oakland,CA,94602,1923,Self-Employed,Teacher, 510 530 5938,,25.00,2/27/2007,800
24331001,Jackie,,Turner,,10410 Pineville Ave.,Cupertino,CA,95014,4523,Self-Employed,Writer,,,25.00,2/27/2007,800
24564650,Alvin,B.,Davidson,,3744 S Monitor Cir.,Stockton,CA,95219,3643,N/A,Retired, 209 477 0311,,250.00,2/22/2007,800
25362336,Byron,D.,Steiger,,20699 NW Rockspring Ln.,Beaverton,OR,97006,6491,,Professor, 503 533 5323,,25.00,2/21/2007,800
25613480,Charles,W.,Curtis,,3895 Spring Blvd.,Eugene,OR,97405,5806,Retired Univ Ore Math Professo,R, 541 342 6769,,100.00,2/22/2007,800
25906363,James,,Bardeen,,7321 47th Ave. NE,Seattle,WA,98115,6102,Univ of Washington,Professor, 206 525 8153,,100.00,2/27/2007,800
28416337,Wayne,E.,Metsker,,8717 22nd Avenue N.W.,Seattle,WA,98117,3715,N/A,Retired Teacher, 206 783 4935,,107.00,2/21/2007,800
1802321,Thomas,,Fox,,47 Bridgewater Rd.,New Milford,CT,06776,3736,N/A,Retired, 860 354 1242,,30.00,2/23/2007,800
26151027,Gilbert,G.,Anderson,,5805 S Park Avenue,Tacoma,WA,98408,5637,N/A,Retired, 253 474 2114,,30.00,2/27/2007,800
26161836,Jenny,,Hartley,,6126 53rd Street Ct. W,University Place,WA,98467,2963,Tacoma Public Library,Librarian, 253 564 0238,JEHARTLEYEJUN@COM,75.00,2/27/2007,800
26313726,Kae,,Hopkins,,4208 W Wernett Rd.,Pasco,WA,99301,2564,N/A,Retired, 509 547 6631,,200.00,2/26/2007,800
1663632,Bertram,,Spiller,,129 Random Rd.,Fairfield,CT,06825,1451,N/A,Retired, 203 396 0097,,10.00,2/16/2007,800
1876580,William,M.,Heineman,,14 Salem Ln.,Westport,CT,06880,3721,Heineman & Co.,Textiles, 203 226 9706,,100.00,2/27/2007,800
5108758,Barbara,,Curtis,,647A Nutley Dr.,Monroe Township,NJ,08831,5247,N/A,Retired, 609 655 7502,,45.00,2/6/2007,800
27976786,Ingrid,,Edwards,Apt. 15,252 W 30th St.,New York,NY,10001,4947,Self-Employed,Artist, 212 594 6467,,25.00,2/6/2007,800
3035789,Vera,J.,Dailey,Apt. 4C,346 E 49th St.,New York,NY,10017,1627,N/A,Retired, 212 355 5759,,50.00,2/6/2007,800
4136909,William,J.,Whitehorn,Apt. 2A,171 S Middle Neck Rd.,Great Neck,NY,11021,4607,,, 516 482 0448,,15.00,2/6/2007,800
4574406,Rochelle,F.,Grossman,,8050 Baxter Ave. Apt. 3D,Flushing,NY,11373,1354,N/A,Retired, 718 457 1490,,50.00,2/6/2007,800
26589200,Norman,H.,Kass,,342 Balchen St.,Massapequa Park,NY,11762,1114,N/A,Retired, 516 541 1811,,5.00,2/6/2007,800
7852874,Calvin,B.,Baldwin,,P.O. Box 17,Garrett Park,MD,20896,0017,N/A,Retired, 301 949 1697,,25.00,2/6/2007,800
11049756,Lois,,Martin,Apt. 1705,801 Chestnut St.,Clearwater,FL,33756,5612,N/A,Retired, 727 446 9482,,50.00,2/6/2007,800
26597617,Lillian,,Perkins,Apt. 212,3710 American Way,Missoula,MT,59808,1926,N/A,Retired Teacher, 406 543 6683,,30.00,2/6/2007,800
18072967,G.,,Le Gendre,,701 17th Ave. N,Texas City,TX,77590,5745,N/A,Retired, 409 945 5345,,50.00,2/6/2007,800
27967959,Omar,,Stuenkel,,6498 E French Gulch Rd.,Coeur D Alene,ID,83814,7751,,, 509 892 2126,,15.00,2/6/2007,800
21339403,Julie,C.,Barton,,314 N Clybourn Avenue,Burbank,CA,91505,3701,N/A,Retired, 818 841 7785,,30.00,2/6/2007,800
25238767,Jean,R.,Imamoto,Apt. 505,1624 Kanunu St.,Honolulu,HI,96814,2763,N/A,Retired Librarian, 808 621 5056,,50.00,2/6/2007,800
24467060,Joor,,Bol,,1000 Starlite Pl.,Ashland,OR,97520,3433,N/A,Retired, 541 488 6484,,5.00,2/6/2007,800
335065694,Selma,H.,Lamkin,,23 Victoria Heights Rd.,Hyde Park,MA,02136,3257,Self-Employed,Cpa, 617 361 2101,SELMA.LAMKIN@VERIZON.NET,70.00,2/9/2007,800
27620780,Peter,W.,Ambler,Apt. 604,984 Memorial Dr.,Cambridge,MA,02138,5747,Self-Employed,Architect, 617 547 1733,,50.00,2/7/2007,800
27221894,Ruth,,Small,,1 Manchester Rd.,Flemington,NJ,08822,6822,N/A,Retired, 908 788 8987,MOMSMALL@PATMEDIA.NET,35.00,2/9/2007,800
2916096,Nicholas,,Kepros,Apt. 4R,77 Washington Pl.,New York,NY,10011,9139,N/A,Retired, 212 475 6276,NKEPROS@COMPUSERVE.COM,50.00,2/9/2007,800
1515485,George,B.,Bookman,Apt. D1004,200 E 66th St.,New York,NY,10021,9189,N/A,Retired, 212 759 1723,,40.00,2/9/2007,800
27124122,Arnold,E.,Messner,,8 Surrey Ln.,Great Neck,NY,11023,1518,N/A,Retired, 516 487 3780,,15.00,2/7/2007,800
4711933,Paul,,Kaufman,,8277 167th St.,Jamaica,NY,11432,1822,N/A,Retired, 718 380 0378,BOONDOCKER88@MSN.COM,10.00,2/7/2007,800
6850325,John,N.,Sparks,,38393 Walnut Ln.,Selbyville,DE,19975,3964,,, 302 436 5303,,35.00,2/7/2007,800
7074891,Earl,P.,Williams,Apt. 201,2323 40th Pl. NW,Washington,DC,20007,1630,N/A,Retired, 202 338 0373,,25.00,2/7/2007,800
9634478,Lauren,,Brubaker,Apt. 4207,10450 Lottsford Rd.,Bowie,MD,20721,2752,N/A,Retired, 301 925 7371,,100.00,2/7/2007,800
7582687,John,R.,Welton,,10512 Farnham Dr.,Bethesda,MD,20814,2222,Corestaff,Pay Bill Specialist, 301 530 6942,,40.00,2/7/2007,800
7629975,Frederick H,H.,Walton,Apt. 2601,9707 Old Georgetown Rd.,Bethesda,MD,20814,1762,N/A,Retired, 301 571 8541,,100.00,2/9/2007,800
7025711,Kathy,,Strom,,7212 Ridgewood Ave.,Chevy Chase,MD,20815,5146,,Attorney, 301 718 0334,,57.00,2/7/2007,800
7776644,Gordon,,Hempton,,1380 Kimblewick Rd.,Rockville,MD,20854,6163,N/A,Retired, 301 279 7045,,25.00,2/9/2007,800
7997349,Robert,Y.,Hirano,,9 Park Valley Rd.,Silver Spring,MD,20910,5424,N/A,Retired, 301 589 5488,,85.00,2/7/2007,800
8860447,Carl,,Quanstrom,Apt. 3001,8800 Walther Blvd.,Baltimore,MD,21234,9067,N/A,Retired, 410 663 4598,,28.00,2/9/2007,800
27568237,Dorothy,,Jacobson,,2823 Grove Ave.,Richmond,VA,23221,2402,N/A,Retired,,,12.00,2/9/2007,800
14489199,Philip,,Jordan,,243 College Pl.,Norfolk,VA,23510,0907,N/A,Retired, 757 625 1058,,20.00,2/8/2007,800
9090101,Charles,C.,Barr,,15152 Wilderness Road,Bristol,VA,24202,4144,N/A,Retired, 276 669 3065,,35.00,2/8/2007,800
11726429,Henry,D.,Wattenbarger,,114 W Loveliss St.,Kingston,TN,37763,2719,N/A,Disabled, 865 376 5129,,2.00,2/9/2007,800
13229323,William,J.,Fuller,,23409 Hughes Ave.,Hazel Park,MI,48030,1553,N/A,Retired, 248 542 4008,,20.00,2/9/2007,800
13680756,Larry,A.,Semrau,,1123 Summergreen Ln.,Lansing,MI,48917,9283,N/A,Retired, 517 323 3898,,25.00,2/9/2007,800
13895354,John,W.,Epperson,,310 W Kentucky Ave.,Indianola,IA,50125,1113,Simpson College,Teacher, 515 961 7215,,10.00,2/7/2007,800
15782931,Patrick,E.,McGee,,9433 S Indiana Ave.,Chicago,IL,60619,7213,Usps,Clerk,,,100.00,2/7/2007,800
26631366,Jeanette,,Gross,,185 Half Moon St.,Lincoln,IL,62656,1326,N/A,Retired, 217 735 1177,,50.00,2/8/2007,800
16549123,Kenneth,I.,Parker,,7509 E 118th St.,Kansas City,MO,64134,3936,N/A,Retired, 816 761 0841,,25.00,2/7/2007,800
16762387,Glen,D.,Montgomery,,735 N.E. Poplar Street,Topeka,KS,66616,1320,N/A,Retired, 785 357 1537,,50.00,2/9/2007,800
19341734,Susan,,Jackson,,710 E La Jolla Dr.,Tempe,AZ,85282,5355,N/A,Retired Teacher, 480 967 2276,,50.00,2/8/2007,800
499574,Felix,,Levenbach,Apt. 3201,7500 N Calle Sin Envidia,Tucson,AZ,85718,7354,N/A,Retired, 520 299 5187,,60.00,2/8/2007,800
20217725,Miles,X.,Hillis,Apt. 206,289 S Barrington Ave.,Los Angeles,CA,90049,3342,N/A,Retired, 310 472 3522,,100.00,2/2/2007,800
20236618,Jean,,Sanville,,1300 N Tigertail Rd.,Los Angeles,CA,90049,1427,Self-Employed,Psychoanalyst, 310 472 6452,,45.00,2/7/2007,800
22334353,Marlies,,Natzler,Unit B,729 Avenida Majorca,Laguna Woods,CA,92637,4463,N/A,Retired, 949 859 6830,,50.00,2/8/2007,800
23348030,Jilma,,Marshall,,608 Steiner St.,San Francisco,CA,94117,2528,N/A,Retired, 415 621 9512,,5.00,2/7/2007,800
28537868,Margaret,,Halmy,Apt. 324,2020 Kittredge St.,Berkeley,CA,94704,1450,,, 310 444 7399,,50.00,2/8/2007,800
25037201,Vincent,L.,Weis,,1109 34th Ave.,Sacramento,CA,95822,2403,N/A,Retired,,,25.00,2/7/2007,800
27179571,Edward,T.,Dunn,,17 Kipling St.,Springfield,MA,01118,1229,N/A,Retired, 413 782 5579,,7.50,2/13/2007,800
27740992,Douglas,,Maynard,,12 Rivermead Rd.,Peterborough,NH,03458,1701,N/A,Retired, 603 924 4848,,250.00,2/12/2007,800
3019528,Miriam,,Malach,Apt. 5N,630 1st Ave.,New York,NY,10016,3786,N/A,Retired, 212 545 9516,,60.00,2/13/2007,800
5758453,Beatrice,G.,Rosenberg,,379 Savage Farm Drive,Ithaca,NY,14850,6505,,, 607 257 7118,BGR3@CORNELL.EDU,45.00,2/16/2007,800
28421105,Norman,,Ikari,,8722 Drexel Hill Pl.,Gaithersburg,MD,20886,4959,N/A,Retired, 301 869 5543,,25.00,2/14/2007,800
28421105,Norman,,Ikari,,8722 Drexel Hill Pl.,Gaithersburg,MD,20886,4959,N/A,Retired, 301 869 5543,,25.00,2/14/2007,800
8224784,Donald,P.,Hoster,,625 Parkwyrth Ave.,Baltimore,MD,21218,1956,State of Md College,Retired Professor, 410 243 4784,DHSTR2@MSN.COM,5.00,2/14/2007,800
18425660,Larry,S.,Roberts,,27700 SW 164th Ave.,Homestead,FL,33031,2846,Self-Employed,Biologist, 305 245 3310,,100.00,2/12/2007,800
10346021,W. Joseph,,Doogue,,13222 46th Ct. N,West Palm Beach,FL,33411,8425,N/A,Retired, 561 753 9787,,15.00,2/13/2007,800
12201364,Marguerite,,Turnbull,Apt. 301,4590 Knightsbridge Blvd.,Columbus,OH,43214,4328,N/A,Retired, 614 273 0595,,300.00,2/12/2007,800
12422887,Robert,,Welty,,1233 Overlook Rd.,Lakewood,OH,44107,1035,,, 216 521 6993,,30.00,2/16/2007,800
13641329,Mary,,Ries,,1529 Cahill Dr.,East Lansing,MI,48823,4724,Mi State Univ,Professor, 517 351 7099,,50.00,2/12/2007,800
27811694,Joseph,T.,Houlihan,,2844 Canterbury Dr.,Northbrook,IL,60062,6902,Promar Enterprises,Sales & Marketing, 847 564 3504,,50.00,2/5/2007,800
18169177,Frank,L.,Whitehead,,11503 Heap Circle,San Antonio,TX,78230,1623,N/A,Retired, 210 691 1590,,100.00,2/16/2007,800
22746788,Dirk,R.,Walters,,392 Christina Way,Sn Luis Obisp,CA,93405,1236,Cal Poly,Retired Teacher, 805 543 7051,,125.00,2/12/2007,800
24604753,Pauline,,Trabucco,Apt. 1,5535 N Fresno St.,Fresno,CA,93710,6081,N/A,Retired, 209 966 2431,,10.00,2/13/2007,800
23348030,Jilma,,Marshall,,608 Steiner St.,San Francisco,CA,94117,2528,N/A,Retired, 415 621 9512,,5.00,2/16/2007,800
28961167,Florence,,Remington,,345 Bickford Dr.,Grants Pass,OR,97527,9603,N/A,Retired,,,25.00,2/12/2007,800
2753473,Richard,S.,Dorer,,8103 Steilacoom Blvd. SW,Tacoma,WA,98498,6154,,,,,50.00,2/16/2007,800
316091,Marilyn,M.,Lee,,19 Orchard St.,Greenfield,MA,01301,3013,N/A,Attorney, 413 773 8477,,135.00,2/28/2007,800
28223519,Sally,,Bell,,35 Felt Rd.,Keene,NH,03431,2103,N/A,Retired, 603 352 0032,,100.00,2/28/2007,800
1351030,Robert,,Weiss,,85 Dillingham Hill Rd.,Auburn,ME,04210,8734,Andro Scoggin Cardiology,Physician, 207 786 2296,,200.00,2/22/2007,800
2597961,Esther,,Dresner,,123 Longview Dr.,Princeton,NJ,08540,5638,N/A,Homemaker, 609 921 7009,,40.00,2/28/2007,800
2617355,Barbara,,Westergaard,,40 Pine Street,Princeton,NJ,08542,3810,Self-Employed,Writer, 609 924 5769,,100.00,2/22/2007,800
2145936,Milton,,Shapiro,,9859 Clark St.,Philadelphia,PA,19115,2305,N/A,Retired, 215 671 9240,,40.00,2/28/2007,800
285221,Roberta,J.,Warren,,1321 Irving St. NW,Washington,DC,20010,2313,Management Systems Intl,Consultant, 202 483 1537,,50.00,2/27/2007,800
28977429,Virginia,,Pollok,,7528 Ridge Rd.,Frederick,MD,21702,3520,N/A,Retired Office Manager, 301 371 7578,,25.00,2/27/2007,800
8701963,Leslie,,Knipling,,5059 36th St. N,Arlington,VA,22207,2946,Nih,Biologist, 703 533 2895,,90.00,2/28/2007,800
9359084,Isabelle,,Buckley,,2409 Stafford Ave.,Raleigh,NC,27607,7240,N/A,Retired, 919 834 8121,,225.00,2/28/2007,800
12722690,William,,Klykylo,,7633 Pineglen Dr.,Cincinnati,OH,45224,1229,Wright State Univ,Physician, 513 522 0593,,110.00,2/28/2007,800
13895354,John,W.,Epperson,,310 W Kentucky Ave.,Indianola,IA,50125,1113,Simpson College,Teacher, 515 961 7215,,10.00,2/28/2007,800
14137319,Jim,,Snitzer,,918 Fairchild St.,Iowa City,IA,52245,3022,Univ of Ia,Instructor, 319 338 3965,,25.00,2/28/2007,800
14770259,Pete,,Kasal,,20545 York Rd.,Hutchinson,MN,55350,6702,Keefe & Kasal,Attorney, 320 587 6361,,45.00,2/28/2007,800
15679574,Mary,M.,Naughton,Apt. 306,500 E Saint Charles Rd.,Lombard,IL,60148,7209,N/A,Retired, 847 961 6293,,100.00,2/28/2007,800
15710668,Kate,,Ollendorff,,1440 N Lake Shore Dr.,Chicago,IL,60610,1626,,, 312 337 6156,,100.00,2/23/2007,800
28613834,Bruno,,Adamik,,5411 S Natoma Ave.,Chicago,IL,60638,2411,,, 773 229 8154,,10.00,2/28/2007,800
312942,George,,Hamilton,,121 Gale Rd.,Williamstown,MA,01267,2808,,, 413 458 8626,,20.00,2/22/2007,800
18340760,Katheryn,,Clark,,4308 Avenue D,Austin,TX,78751,3713,N/A,Retired, 512 453 6246,,35.00,2/28/2007,800
18315440,Clark,,Hubbs,,Catherine Hubbs,Austin,TX,78757,,,Retired Professor, 512 453 6795,,100.00,2/28/2007,800
19573724,Joseph,,Wexler,,610 Ridge Pl. NE,Albuquerque,NM,87106,4538,Self-Employed,Civil Engineer, 505 247 8401,,15.00,2/28/2007,800
20268397,John,L.,Frankel,,3239 Club Dr.,Los Angeles,CA,90064,4811,N/A,Retired,,,150.00,2/28/2007,800
20482626,Sara,,Content,,671 30th St.,Hermosa Beach,CA,90254,2212,,, 310 318 1401,,50.00,2/28/2007,800
24044992,Dorothy,P.,Rice,,33 Linda Ave. Apt. 1405,Oakland,CA,94611,4817,N/A,Retired, 510 638 1429,DRICE39223@AOL.COM,100.00,2/27/2007,800
24046146,Mary,Roth,Sharman,,1311 Grizzly Peak Blvd.,Berkeley,CA,94708,2129,N/A,Retired, 510 644 8072,,50.00,2/23/2007,800
28653848,Peter,,Latorre,101 N 3rd Street,P.O. Box 697,Patterson,CA,95363,0697,Self-Employed,Medicine, 209 892 8511,,25.00,2/28/2007,800
1033661,Ruth,C.,Glavey,Apt. 2A,57 Summer St.,Plymouth,MA,02360,3461,N/A,Retired, 508 746 4167,,10.00,2/22/2007,800
1540962,Walter,J.,Walek,,P.O. Box 1266,Brewster,MA,02631,7266,N/A,Retired, 508 896 6438,,30.00,2/7/2007,800
11687720,John,E.,Booty,,612 Mt Israel Rd.,Ctr Sandwich,NH,03227,3710,N/A,Retired, 603 284 7380,,20.00,2/22/2007,800
4131389,Maurice,,Kosstrin,Apt. 6E8,3030 Park Ave.,Bridgeport,CT,06604,1162,N/A,Retired, 516 437 1371,,10.00,2/22/2007,800
27140870,Elliot,,Asarnow,,1 Tower Dr.,Maplewood,NJ,07040,1007,Citibank,Banker,,,20.00,2/22/2007,800
2315893,Edmund,A.,Moderacki,,740 White Birch Rd.,Twp. of Washington,NJ,07676,4236,River Vale Bd of Ed,Teacher, 201 263 9630,,31.00,2/22/2007,800
28768869,Jean,,Hildenbrand,798 Willow Grove St.,Village 7B,Hackettstown,NJ,07840,1718,,, 201 285 0742,,10.00,2/22/2007,800
2486256,C.,W.,Fields,,1066 Pendleton Ct.,Voorhees,NJ,08043,1809,Phil School Distr,Teacher, 609 772 0069,,17.00,2/22/2007,800
2635258,Jim,,Clemans,,300 Pennington Lawrenceville Rd.,Pennington,NJ,08534,5116,N/A,Retired, 609 737 1866,,10.00,2/22/2007,800
2619583,Robert,,Greiff,,60 Princeton Ave.,Rocky Hill,NJ,08553,1004,Mgmt Advisors Fo Princeton Inc.,Executive Recruiter, 609 924 4733,,20.00,2/27/2007,800
2619583,Robert,,Greiff,,60 Princeton Ave.,Rocky Hill,NJ,08553,1004,Mgmt Advisors Fo Princeton Inc.,Executive Recruiter, 609 924 4733,,10.00,2/22/2007,800
4625562,Vita,,Rosenberg,Apt. 6W,101 W 12th St.,New York,NY,10011,8112,N/A,Retired, 718 544 3165,,13.00,2/22/2007,800
3279080,Margaret,E.,Wood,Apt. 15,55 W 71st St.,New York,NY,10023,4187,N/A,Retired, 212 362 2724,,10.00,2/22/2007,800
3338985,Carol,E.,Wadsworth,Apt. 8A,102 W 85th St.,New York,NY,10024,4460,Retired Librarian,Retired Librarian,,,15.00,2/22/2007,800
4034518,Stephen,,Skye,,118 Ridge Dr.,Middletown,NY,10940,7104,IBM,Manager, 914 386 3442,,25.00,2/22/2007,800
4984514,Abraham,,Spector,,89 Hemlock Dr.,Farmingdale,NY,11735,2937,N/A,Retired, 516 249 3785,,10.00,2/22/2007,800
5002498,Richard,J.,Scholem,,7 Bayview Ln.,Halesite,NY,11743,1145,N/A,Retired, 631 271 3227,,10.00,2/22/2007,800
5115191,Merle,G.,Hall,,20 Sexton Dr.,West Islip,NY,11795,5133,N/A,Retired, 516 587 7833,,10.00,2/22/2007,800
5454426,Hermine,W.,Williams,,7153 College Hill Rd.,Clinton,NY,13323,4932,Self-Employed,Musician, 315 853 8796,HERMINE@MINDSPRING.COM,10.00,2/22/2007,800
5629753,Callista,,Basta,,4 Cottage St.,Dansville,NY,14437,1716,N/A,Retired, 585 335 6324,,10.00,2/22/2007,800
5665138,Paul,W.,Brayer,,196 Vassar St.,Rochester,NY,14607,3345,N/A,Retired, 716 271 3479,,15.00,2/22/2007,800
28338044,Patricia,A.,O'Neill,Apt. 19,1640 East Ave.,Rochester,NY,14610,1608,Monroe Community College,Education, 716 235 3457,,15.00,2/22/2007,800
6041818,Wilfred,G.,Norris,,1529 Moore St.,Huntingdon,PA,16652,2025,,, 814 643 5112,,10.00,2/22/2007,800
6064752,Jacob,,Long,,115 S King St.,Annville,PA,17003,1718,,, 717 867 4545,,15.00,2/22/2007,800
6871941,Lois,,Greeff,,2649 Stephenson Dr.,Wilmington,DE,19808,3842,N/A,Retired, 302 655 3995,,10.00,2/22/2007,800
6961460,Elaine,J.,Bevilacqua,,110 D St. SE Apt. 212,Washington,DC,20003,1813,Library of Congress,Cataloger, 202 547 2169,,15.00,2/22/2007,800
7256225,Maxine,,Rapoport,,2808 29th St. NW,Washington,DC,20008,4112,Self-Employed,Cookbook Author, 202 387 3362,,25.00,2/22/2007,800
7137433,Walter,G.,Wells,,3606 Veazey Street N.W.,Washington,DC,20008,3135,N/A,Retired, 202 362 0250,,35.00,2/22/2007,800
7669237,Philip,J.,Glaessner,,9019 Burdette Rd.,Bethesda,MD,20817,2113,Self-Employed,Economic Consultant, 301 365 0831,,70.00,2/22/2007,800
7776495,Jacques,A.,Hill,,8503 Timber Hill Ln.,Rockville,MD,20854,4237,N/A,Retired, 301 299 7135,,20.00,2/23/2007,800
8759482,James,L.,Hall,Apt. 510,1045 N Utah St.,Arlington,VA,22201,5754,US Off of Personnel Mgmt,Retired Statistician, 703 841 0360,,20.00,2/22/2007,800
19770080,Margaret,D.,Thomas,,10010 Grass Market Ct.,Fredericksbrg,VA,22408,9209,N/A,Retired, 540 374 1308,,25.00,2/22/2007,800
8898819,E.,D.,Hirsch,,2006 Pine Top Rd.,Charlottesvle,VA,22903,1233,N/A,Retired, 804 296 2631,,30.00,2/22/2007,800
8408924,Jean,,Darby,,1628 Hawthorne Rdg,Blacksburg,VA,24060,6143,,, 540 961 4422,,20.00,2/22/2007,800
9361205,Kerry,S.,Havner,,3331 Thomas Rd.,Raleigh,NC,27607,6743,Ncsu,College Prof, 919 782 1103,,33.00,2/22/2007,800
9694696,Holley,H.,Ulbrich,,106 Highland Dr.,Clemson,SC,29631,1922,Clemson Univ,Professor, 864 654 6828,,30.00,2/22/2007,800
9762337,Hoyt,J.,Cragg,,162 Rockcliff Rd.,Canton,GA,30114,3555,N/A,Retired,,,20.00,2/22/2007,800
9933375,Velta,A.,Boatright,,311 Forest St.,Louisville,GA,30434,1515,N/A,Retired, 478 625 0534,,20.00,2/22/2007,800
2697530,Robert,G.,Latimer,,604 Greenfield Ave.,Mount Dora,FL,32757,9535,N/A,Retired, 908 297 2796,,15.00,2/22/2007,800
11541372,France,A.,Peterson,,2202 Duncansby Dr. SW,Decatur,AL,35603,1135,N/A,Retired, 256 351 1870,,10.00,2/22/2007,800
12412490,Genevieve,,Miller,Apt. 616,1890 E 107th St.,Cleveland,OH,44106,2251,N/A,Retired, 216 791 4645,,10.00,2/22/2007,800
7714447,Anita,W.,Finkelman,,3550 Principio Ave.,Cincinnati,OH,45208,4214,Self-Employed,Registered Nurse, 513 871 1383,,20.00,2/22/2007,800
12785556,Cecile,E.,Cary,,1624 Harvard Blvd.,Dayton,OH,45406,5942,N/A,Retired, 937 278 8619,,35.00,2/22/2007,800
27205228,Arvin,R.,Wells,,40 Forest St.,Athens,OH,45701,1707,N/A,Retired, 614 592 1505,,10.00,2/22/2007,800
13612601,Merlin,B.,Davey,,3031 N Sturgeon Road,Midland,MI,48642,8320,N/A,Retired, 989 631 1542,,20.00,2/22/2007,800
11485430,Dolores,J.,Tuttle,Apt. 80,201 Mall Dr. S,Lansing,MI,48917,2560,N/A,Retired, 517 321 2469,,10.00,2/22/2007,800
14282594,Frank,S.,Kinateder,,710 Oak Ridge Ct.,Waukesha,WI,53188,3001,Usps,Letter Carrier, 414 542 8751,FRANKKINATEDER@HOTMAIL.COM,25.00,2/21/2007,800
14313605,Margie,E.,Boyles,,2426 N Terrace Ave.,Milwaukee,WI,53211,4511,N/A,Retired, 414 964 7037,MARGIEBOYLES@HOTMAIL.COM,150.00,2/22/2007,800
15321185,Gail,M.,Richardson,,5263 Cimmeron Dr.,Bozeman,MT,59715,8756,Self-Employed,Naturalist Guide, 406 585 7206,,15.00,2/22/2007,800
15541048,John,B.,Martin,Apt. 5B,838 Michigan Ave.,Evanston,IL,60202,2537,Self-Employed,Psychologist, 847 869 1392,,15.00,2/22/2007,800
15892821,Helen,G.,Stopek,Ste. 1008,7061 N Kedzie Ave.,Chicago,IL,60645,2866,N/A,Retired, 773 274 5231,HGSTOPEK@SBCGLOBAL.NET,10.00,2/22/2007,800
16168791,Kenneth,E.,Sibley,,32 Mishawaka Dr. #32,Rochester,IL,62563,9473,N/A,Retired, 217 498 9439,,15.00,2/22/2007,800
8756413,Dorothy,R.,Daly,,P.O. Box 627,Scottsbluff,NE,69363,0627,N/A,Retired, 703 370 2498,,10.00,2/22/2007,800
28657153,Minnie,J.,Carson,,12440 Rivercrest Dr.,Little Rock,AR,72212,1440,N/A,Homemaker, 501 227 7715,LSEUGENE@AOL.COM,50.00,2/28/2007,800
18415687,Robert,O.,Taylor,,1112 Riviera Dr.,Norman,OK,73072,7611,N/A,Retired,,,60.00,2/22/2007,800
17386996,Mark,A.,Siegel,,1401 Windy Meadow Dr.,Plano,TX,75023,4962,,, 972 422 4058,,10.00,2/22/2007,800
17590183,Helen,L.,Boyd,,1306 Dartmouth St.,Longview,TX,75601,4315,N/A,Retired,,,40.00,2/22/2007,800
27680263,Robert,E.,Neal,,400 Carolyn Dr.,Bedford,TX,76021,4114,N/A,Retired, 817 428 1976,,10.00,2/22/2007,800
26935965,John,P.,Thornton,,1606 Highland Dr.,Brownwood,TX,76801,6516,N/A,Retired, 760 371 7782,,10.00,2/22/2007,800